{"text_format":"1","workbook":"xlsx","n_sheets":4,"sheets":["Instructions","Summary tab","DataPivot","Master Data Entry Template"],"not_rendered":{"charts":0,"images":0,"macros":1,"external_links":0,"defined_names":2,"comments":1,"pivot_tables":0},"unopened":[],"bounds":{"document_bytes":16777216,"sheet_cells":100000,"rows_first":2000,"rows_last":500,"rows_between":2000,"halvings":0,"cell_chars":16384,"cell_head_chars":4096},"cells_cut":0,"cells_raw":0,"read":"whole","date_system":"1900"}

{"sheet":"Instructions","index":0,"n_rows":37,"n_cols":1,"rows_kept":37,"cut":false,"hidden":false,"merged":[]}
["Instruction for Completing Span of Control Report"]
["OMB is requesting each county department to participate in a Span of Control calculation effort.  Span of control measures the number of individuals a supervisor oversees.  This project is intended to provide departments county-wide with a tool to enable them to consistently calculate and report on span of control.  The data developed can then be used by the departments and OMB in budget development and decision making. "]
[]
["Span of control varies widely depending on several factors.  We know that there will be situations that call for supervisory loads outside a general range of 3 or less to 10 or more direct reports per supervisor.  Therefore, included in this template is the ability for departments to provide information on factors or mitigating circumstances that affect what an appropriate span of control exists for a given supervisor. "]
[]
["Span of Control will need to be calculated for each supervisor in the department.   For smaller departments, a single Excel file with a tab for each manager will be sufficient.  For larger, more complex departments, it is recommended that the department create an Excel file for each division; within each division’s Excel file, each supervisor will have their own tab.  Spreadsheets may be filled out by department, division,  or program managers or human resources staff, as appropriate."]
[]
["For these calculations, departments must count the number of “direct reports” a supervisor has (both filled and vacant).  A direct report is: a) for full time employee, a position for whom a supervisor completes an evaluation and b) for part-time employee, a position for whom the supervisor completes an evaluation OR, if no evaluation is done, a position for whom the supervisor directs and oversees day-to-day assignments."]
[]
["The person completing this template should read through all instructions and the entire 'Master Data Entry Template' categories, types of staff positions and questions before completing the entire workbook.  Do not enter information on the Master Data Entry Template.  Calculate the totals for each type of position and enter the total into the tab named for each individual supervisor.\n\nStart data entry by making a copy of the 'Master Data Entry Template' worksheet.  A new supervisor worksheet can be created by right clicking on the 'Master Data Entry Template' worksheet, choose 'Move or Copy', select '(move to end)' and check 'Create a copy' and press 'OK'.  The new worksheet can be renamed with the supervisor's name.   There should be one worksheet for each supervisor.  Tabs should also be created for vacant supervisor positions -- each Vacant Supervisor should be named Vacant 1, Vacant 2, Vacant 3, etc.  Add the appropriate title for the vacant supervisor position.  Continue making a copy of the master worksheet and entering data for each supervisor and supervisor vacancy until complete.   "]
[]
["Supervisor Definition: The person who completes a performance evaluation and/or directs and oversees day-to-day work assignments of a subordinate.  A direct report is: a) for full time employee, a position for whom a supervisor completes an evaluation and b) for part-time employee, a position for whom the supervisor completes an evaluation OR, if no evaluation is done, a position for whom the supervisor directs and oversees day-to-day assignments."]
[]
["There are two sections on the supervisor tab that will need to be filled in by the department:"]
["Section 1:  Individual Span of Control Calculation"]
["Section 2:  Additional Information"]
[]
["Individual Tab , Section 1:  Individual Span of Control  Calculation "]
["Create a tab for each supervisor in the department.  Rename the tab with the “Last Name, First Initial” of the supervisor.   For large departments, it may be best to use one file for each division within the department.  In that case, a tab for each supervisor will still be needed. Vacant supervisor positions should be named Vacant 1, Vacant 2, Vacant 3, etc. "]
[]
{"$rows_left_out":18}
{"sheet":"Summary tab","index":1,"n_rows":103,"n_cols":11,"rows_kept":103,"cut":false,"hidden":false,"merged":[[0,1,0,7],[1,6,1,10]]}
[null,"This tab provides a summary of each supervisor and the total number of direct reports.  It also identifies outliers where a supervisors has 3 or less or 10 or more FTE direct reports."]
[null,null,null,null,null,null,"Mitigating Factors"]
["Supervisor No.","Supervisor Title","Name","Total Number of FTEs Supervised","Outlier:  Span of Control of <=3 or >=10","Additional FTEs Supervised Periodically","Manager Responsibilities","Level of Risk","Proximity of Direct Reports","Complex or Routine Tasks","Availability of Technology"]
[1,{"$f":"IFERROR(DataPivot!B1,\"-\")","v":"-"},{"$f":"IFERROR(DataPivot!C1,\"-\")","v":"-"},{"$f":"IFERROR(DataPivot!D1,\"-\")","v":"-"},{"$f":"IF(D4=\"-\",\"-\", IF(AND(D4>3,D4<10),\"-\",\"Outlier\"))","v":"-"},{"$f":"IFERROR(DataPivot!E1,\"-\")","v":"-"},{"$f":"IFERROR(DataPivot!F1,\"-\")","v":"-"},{"$f":"IFERROR(DataPivot!G1,\"-\")","v":"-"},{"$f":"IFERROR(DataPivot!H1,\"-\")","v":"-"},{"$f":"IFERROR(DataPivot!I1,\"-\")","v":"-"},{"$f":"IFERROR(DataPivot!J1,\"-\")","v":"-"}]
[2,{"$f":"IFERROR(DataPivot!B2,\"-\")","v":"-"},{"$f":"IFERROR(DataPivot!C2,\"-\")","v":"-"},{"$f":"IFERROR(DataPivot!D2,\"-\")","v":"-"},{"$f":"IF(D5=\"-\",\"-\", IF(AND(D5>3,D5<10),\"-\",\"Outlier\"))","v":"-"},{"$f":"IFERROR(DataPivot!E2,\"-\")","v":"-"},{"$f":"IFERROR(DataPivot!F2,\"-\")","v":"-"},{"$f":"IFERROR(DataPivot!G2,\"-\")","v":"-"},{"$f":"IFERROR(DataPivot!H2,\"-\")","v":"-"},{"$f":"IFERROR(DataPivot!I2,\"-\")","v":"-"},{"$f":"IFERROR(DataPivot!J2,\"-\")","v":"-"}]
[3,{"$f":"IFERROR(DataPivot!B3,\"-\")","v":"-"},{"$f":"IFERROR(DataPivot!C3,\"-\")","v":"-"},{"$f":"IFERROR(DataPivot!D3,\"-\")","v":"-"},"-",{"$f":"IFERROR(DataPivot!E3,\"-\")","v":"-"},{"$f":"IFERROR(DataPivot!F3,\"-\")","v":"-"},{"$f":"IFERROR(DataPivot!G3,\"-\")","v":"-"},{"$f":"IFERROR(DataPivot!H3,\"-\")","v":"-"},{"$f":"IFERROR(DataPivot!I3,\"-\")","v":"-"},{"$f":"IFERROR(DataPivot!J3,\"-\")","v":"-"}]
[4,{"$f":"IFERROR(DataPivot!B4,\"-\")","v":"-"},{"$f":"IFERROR(DataPivot!C4,\"-\")","v":"-"},{"$f":"IFERROR(DataPivot!D4,\"-\")","v":"-"},"-",{"$f":"IFERROR(DataPivot!E4,\"-\")","v":"-"},{"$f":"IFERROR(DataPivot!F4,\"-\")","v":"-"},{"$f":"IFERROR(DataPivot!G4,\"-\")","v":"-"},{"$f":"IFERROR(DataPivot!H4,\"-\")","v":"-"},{"$f":"IFERROR(DataPivot!I4,\"-\")","v":"-"},{"$f":"IFERROR(DataPivot!J4,\"-\")","v":"-"}]
[5,{"$f":"IFERROR(DataPivot!B5,\"-\")","v":"-"},{"$f":"IFERROR(DataPivot!C5,\"-\")","v":"-"},{"$f":"IFERROR(DataPivot!D5,\"-\")","v":"-"},"-",{"$f":"IFERROR(DataPivot!E5,\"-\")","v":"-"},{"$f":"IFERROR(DataPivot!F5,\"-\")","v":"-"},{"$f":"IFERROR(DataPivot!G5,\"-\")","v":"-"},{"$f":"IFERROR(DataPivot!H5,\"-\")","v":"-"},{"$f":"IFERROR(DataPivot!I5,\"-\")","v":"-"},{"$f":"IFERROR(DataPivot!J5,\"-\")","v":"-"}]
[6,{"$f":"IFERROR(DataPivot!B6,\"-\")","v":"-"},{"$f":"IFERROR(DataPivot!C6,\"-\")","v":"-"},{"$f":"IFERROR(DataPivot!D6,\"-\")","v":"-"},"-",{"$f":"IFERROR(DataPivot!E6,\"-\")","v":"-"},{"$f":"IFERROR(DataPivot!F6,\"-\")","v":"-"},{"$f":"IFERROR(DataPivot!G6,\"-\")","v":"-"},{"$f":"IFERROR(DataPivot!H6,\"-\")","v":"-"},{"$f":"IFERROR(DataPivot!I6,\"-\")","v":"-"},{"$f":"IFERROR(DataPivot!J6,\"-\")","v":"-"}]
[7,{"$f":"IFERROR(DataPivot!B7,\"-\")","v":"-"},{"$f":"IFERROR(DataPivot!C7,\"-\")","v":"-"},{"$f":"IFERROR(DataPivot!D7,\"-\")","v":"-"},"-",{"$f":"IFERROR(DataPivot!E7,\"-\")","v":"-"},{"$f":"IFERROR(DataPivot!F7,\"-\")","v":"-"},{"$f":"IFERROR(DataPivot!G7,\"-\")","v":"-"},{"$f":"IFERROR(DataPivot!H7,\"-\")","v":"-"},{"$f":"IFERROR(DataPivot!I7,\"-\")","v":"-"},{"$f":"IFERROR(DataPivot!J7,\"-\")","v":"-"}]
[8,{"$f":"IFERROR(DataPivot!B8,\"-\")","v":"-"},{"$f":"IFERROR(DataPivot!C8,\"-\")","v":"-"},{"$f":"IFERROR(DataPivot!D8,\"-\")","v":"-"},"-",{"$f":"IFERROR(DataPivot!E8,\"-\")","v":"-"},{"$f":"IFERROR(DataPivot!F8,\"-\")","v":"-"},{"$f":"IFERROR(DataPivot!G8,\"-\")","v":"-"},{"$f":"IFERROR(DataPivot!H8,\"-\")","v":"-"},{"$f":"IFERROR(DataPivot!I8,\"-\")","v":"-"},{"$f":"IFERROR(DataPivot!J8,\"-\")","v":"-"}]
[9,{"$f":"IFERROR(DataPivot!B9,\"-\")","v":"-"},{"$f":"IFERROR(DataPivot!C9,\"-\")","v":"-"},{"$f":"IFERROR(DataPivot!D9,\"-\")","v":"-"},"-",{"$f":"IFERROR(DataPivot!E9,\"-\")","v":"-"},{"$f":"IFERROR(DataPivot!F9,\"-\")","v":"-"},{"$f":"IFERROR(DataPivot!G9,\"-\")","v":"-"},{"$f":"IFERROR(DataPivot!H9,\"-\")","v":"-"},{"$f":"IFERROR(DataPivot!I9,\"-\")","v":"-"},{"$f":"IFERROR(DataPivot!J9,\"-\")","v":"-"}]
[10,{"$f":"IFERROR(DataPivot!B10,\"-\")","v":"-"},{"$f":"IFERROR(DataPivot!C10,\"-\")","v":"-"},{"$f":"IFERROR(DataPivot!D10,\"-\")","v":"-"},"-",{"$f":"IFERROR(DataPivot!E10,\"-\")","v":"-"},{"$f":"IFERROR(DataPivot!F10,\"-\")","v":"-"},{"$f":"IFERROR(DataPivot!G10,\"-\")","v":"-"},{"$f":"IFERROR(DataPivot!H10,\"-\")","v":"-"},{"$f":"IFERROR(DataPivot!I10,\"-\")","v":"-"},{"$f":"IFERROR(DataPivot!J10,\"-\")","v":"-"}]
[11,{"$f":"IFERROR(DataPivot!B11,\"-\")","v":"-"},{"$f":"IFERROR(DataPivot!C11,\"-\")","v":"-"},{"$f":"IFERROR(DataPivot!D11,\"-\")","v":"-"},"-",{"$f":"IFERROR(DataPivot!E11,\"-\")","v":"-"},{"$f":"IFERROR(DataPivot!F11,\"-\")","v":"-"},{"$f":"IFERROR(DataPivot!G11,\"-\")","v":"-"},{"$f":"IFERROR(DataPivot!H11,\"-\")","v":"-"},{"$f":"IFERROR(DataPivot!I11,\"-\")","v":"-"},{"$f":"IFERROR(DataPivot!J11,\"-\")","v":"-"}]
[12,{"$f":"IFERROR(DataPivot!B12,\"-\")","v":"-"},{"$f":"IFERROR(DataPivot!C12,\"-\")","v":"-"},{"$f":"IFERROR(DataPivot!D12,\"-\")","v":"-"},"-",{"$f":"IFERROR(DataPivot!E12,\"-\")","v":"-"},{"$f":"IFERROR(DataPivot!F12,\"-\")","v":"-"},{"$f":"IFERROR(DataPivot!G12,\"-\")","v":"-"},{"$f":"IFERROR(DataPivot!H12,\"-\")","v":"-"},{"$f":"IFERROR(DataPivot!I12,\"-\")","v":"-"},{"$f":"IFERROR(DataPivot!J12,\"-\")","v":"-"}]
[13,{"$f":"IFERROR(DataPivot!B13,\"-\")","v":"-"},{"$f":"IFERROR(DataPivot!C13,\"-\")","v":"-"},{"$f":"IFERROR(DataPivot!D13,\"-\")","v":"-"},"-",{"$f":"IFERROR(DataPivot!E13,\"-\")","v":"-"},{"$f":"IFERROR(DataPivot!F13,\"-\")","v":"-"},{"$f":"IFERROR(DataPivot!G13,\"-\")","v":"-"},{"$f":"IFERROR(DataPivot!H13,\"-\")","v":"-"},{"$f":"IFERROR(DataPivot!I13,\"-\")","v":"-"},{"$f":"IFERROR(DataPivot!J13,\"-\")","v":"-"}]
[14,{"$f":"IFERROR(DataPivot!B14,\"-\")","v":"-"},{"$f":"IFERROR(DataPivot!C14,\"-\")","v":"-"},{"$f":"IFERROR(DataPivot!D14,\"-\")","v":"-"},"-",{"$f":"IFERROR(DataPivot!E14,\"-\")","v":"-"},{"$f":"IFERROR(DataPivot!F14,\"-\")","v":"-"},{"$f":"IFERROR(DataPivot!G14,\"-\")","v":"-"},{"$f":"IFERROR(DataPivot!H14,\"-\")","v":"-"},{"$f":"IFERROR(DataPivot!I14,\"-\")","v":"-"},{"$f":"IFERROR(DataPivot!J14,\"-\")","v":"-"}]
[15,{"$f":"IFERROR(DataPivot!B15,\"-\")","v":"-"},{"$f":"IFERROR(DataPivot!C15,\"-\")","v":"-"},{"$f":"IFERROR(DataPivot!D15,\"-\")","v":"-"},"-",{"$f":"IFERROR(DataPivot!E15,\"-\")","v":"-"},{"$f":"IFERROR(DataPivot!F15,\"-\")","v":"-"},{"$f":"IFERROR(DataPivot!G15,\"-\")","v":"-"},{"$f":"IFERROR(DataPivot!H15,\"-\")","v":"-"},{"$f":"IFERROR(DataPivot!I15,\"-\")","v":"-"},{"$f":"IFERROR(DataPivot!J15,\"-\")","v":"-"}]
[16,{"$f":"IFERROR(DataPivot!B16,\"-\")","v":"-"},{"$f":"IFERROR(DataPivot!C16,\"-\")","v":"-"},{"$f":"IFERROR(DataPivot!D16,\"-\")","v":"-"},"-",{"$f":"IFERROR(DataPivot!E16,\"-\")","v":"-"},{"$f":"IFERROR(DataPivot!F16,\"-\")","v":"-"},{"$f":"IFERROR(DataPivot!G16,\"-\")","v":"-"},{"$f":"IFERROR(DataPivot!H16,\"-\")","v":"-"},{"$f":"IFERROR(DataPivot!I16,\"-\")","v":"-"},{"$f":"IFERROR(DataPivot!J16,\"-\")","v":"-"}]
[17,{"$f":"IFERROR(DataPivot!B17,\"-\")","v":"-"},{"$f":"IFERROR(DataPivot!C17,\"-\")","v":"-"},{"$f":"IFERROR(DataPivot!D17,\"-\")","v":"-"},"-",{"$f":"IFERROR(DataPivot!E17,\"-\")","v":"-"},{"$f":"IFERROR(DataPivot!F17,\"-\")","v":"-"},{"$f":"IFERROR(DataPivot!G17,\"-\")","v":"-"},{"$f":"IFERROR(DataPivot!H17,\"-\")","v":"-"},{"$f":"IFERROR(DataPivot!I17,\"-\")","v":"-"},{"$f":"IFERROR(DataPivot!J17,\"-\")","v":"-"}]
{"$rows_left_out":84}
{"sheet":"DataPivot","index":2,"n_rows":100,"n_cols":10,"rows_kept":100,"cut":false,"hidden":true,"merged":[]}
["abc",{"$f":"INDIRECT(\"'\"&$A1&\"'!$D$1\")","v":{"$error":"#REF!"}},{"$f":"INDIRECT(\"'\"&$A1&\"'!$D$2\")","v":{"$error":"#REF!"}},{"$f":"INDIRECT(\"'\"&$A1&\"'!$D$8\")","v":{"$error":"#REF!"}},{"$f":"INDIRECT(\"'\"&$A1&\"'!$D$11\")+INDIRECT(\"'\"&$A1&\"'!$D$12\")+INDIRECT(\"'\"&$A1&\"'!$D$13\")+INDIRECT(\"'\"&$A1&\"'!$D$14\")","v":{"$error":"#REF!"}},{"$f":"INDIRECT(\"'\"&$A1&\"'!$D$16\")","v":{"$error":"#REF!"}},{"$f":"INDIRECT(\"'\"&$A1&\"'!$D$17\")","v":{"$error":"#REF!"}},{"$f":"INDIRECT(\"'\"&$A1&\"'!$D$18\")","v":{"$error":"#REF!"}},{"$f":"INDIRECT(\"'\"&$A1&\"'!$D$19\")","v":{"$error":"#REF!"}},{"$f":"INDIRECT(\"'\"&$A1&\"'!$D$20\")","v":{"$error":"#REF!"}}]
["S.2",{"$f":"INDIRECT(\"'\"&$A2&\"'!$D$1\")","v":{"$error":"#REF!"}},{"$f":"INDIRECT(\"'\"&$A2&\"'!$D$2\")","v":{"$error":"#REF!"}},{"$f":"INDIRECT(\"'\"&$A2&\"'!$D$8\")","v":{"$error":"#REF!"}},{"$f":"INDIRECT(\"'\"&$A2&\"'!$D$11\")+INDIRECT(\"'\"&$A2&\"'!$D$12\")+INDIRECT(\"'\"&$A2&\"'!$D$13\")+INDIRECT(\"'\"&$A2&\"'!$D$14\")","v":{"$error":"#REF!"}},{"$f":"INDIRECT(\"'\"&$A2&\"'!$D$16\")","v":{"$error":"#REF!"}},{"$f":"INDIRECT(\"'\"&$A2&\"'!$D$17\")","v":{"$error":"#REF!"}},{"$f":"INDIRECT(\"'\"&$A2&\"'!$D$18\")","v":{"$error":"#REF!"}},{"$f":"INDIRECT(\"'\"&$A2&\"'!$D$19\")","v":{"$error":"#REF!"}},{"$f":"INDIRECT(\"'\"&$A2&\"'!$D$20\")","v":{"$error":"#REF!"}}]
["S.3",{"$error":"#REF!"},{"$error":"#REF!"},{"$error":"#REF!"},{"$error":"#REF!"},{"$error":"#REF!"},{"$error":"#REF!"},{"$error":"#REF!"},{"$error":"#REF!"},{"$error":"#REF!"}]
["S.4",{"$error":"#REF!"},{"$error":"#REF!"},{"$error":"#REF!"},{"$error":"#REF!"},{"$error":"#REF!"},{"$error":"#REF!"},{"$error":"#REF!"},{"$error":"#REF!"},{"$error":"#REF!"}]
["S.5",{"$error":"#REF!"},{"$error":"#REF!"},{"$error":"#REF!"},{"$error":"#REF!"},{"$error":"#REF!"},{"$error":"#REF!"},{"$error":"#REF!"},{"$error":"#REF!"},{"$error":"#REF!"}]
["S.6",{"$error":"#REF!"},{"$error":"#REF!"},{"$error":"#REF!"},{"$error":"#REF!"},{"$error":"#REF!"},{"$error":"#REF!"},{"$error":"#REF!"},{"$error":"#REF!"},{"$error":"#REF!"}]
["S.7",{"$error":"#REF!"},{"$error":"#REF!"},{"$error":"#REF!"},{"$error":"#REF!"},{"$error":"#REF!"},{"$error":"#REF!"},{"$error":"#REF!"},{"$error":"#REF!"},{"$error":"#REF!"}]
["S.8",{"$error":"#REF!"},{"$error":"#REF!"},{"$error":"#REF!"},{"$error":"#REF!"},{"$error":"#REF!"},{"$error":"#REF!"},{"$error":"#REF!"},{"$error":"#REF!"},{"$error":"#REF!"}]
["S.9",{"$error":"#REF!"},{"$error":"#REF!"},{"$error":"#REF!"},{"$error":"#REF!"},{"$error":"#REF!"},{"$error":"#REF!"},{"$error":"#REF!"},{"$error":"#REF!"},{"$error":"#REF!"}]
["S.10",{"$error":"#REF!"},{"$error":"#REF!"},{"$error":"#REF!"},{"$error":"#REF!"},{"$error":"#REF!"},{"$error":"#REF!"},{"$error":"#REF!"},{"$error":"#REF!"},{"$error":"#REF!"}]
["S.11",{"$error":"#REF!"},{"$error":"#REF!"},{"$error":"#REF!"},{"$error":"#REF!"},{"$error":"#REF!"},{"$error":"#REF!"},{"$error":"#REF!"},{"$error":"#REF!"},{"$error":"#REF!"}]
["S.12",{"$error":"#REF!"},{"$error":"#REF!"},{"$error":"#REF!"},{"$error":"#REF!"},{"$error":"#REF!"},{"$error":"#REF!"},{"$error":"#REF!"},{"$error":"#REF!"},{"$error":"#REF!"}]
["S.13",{"$error":"#REF!"},{"$error":"#REF!"},{"$error":"#REF!"},{"$error":"#REF!"},{"$error":"#REF!"},{"$error":"#REF!"},{"$error":"#REF!"},{"$error":"#REF!"},{"$error":"#REF!"}]
["S.14",{"$error":"#REF!"},{"$error":"#REF!"},{"$error":"#REF!"},{"$error":"#REF!"},{"$error":"#REF!"},{"$error":"#REF!"},{"$error":"#REF!"},{"$error":"#REF!"},{"$error":"#REF!"}]
["S.15",{"$error":"#REF!"},{"$error":"#REF!"},{"$error":"#REF!"},{"$error":"#REF!"},{"$error":"#REF!"},{"$error":"#REF!"},{"$error":"#REF!"},{"$error":"#REF!"},{"$error":"#REF!"}]
["S.16",{"$error":"#REF!"},{"$error":"#REF!"},{"$error":"#REF!"},{"$error":"#REF!"},{"$error":"#REF!"},{"$error":"#REF!"},{"$error":"#REF!"},{"$error":"#REF!"},{"$error":"#REF!"}]
["S.17",{"$error":"#REF!"},{"$error":"#REF!"},{"$error":"#REF!"},{"$error":"#REF!"},{"$error":"#REF!"},{"$error":"#REF!"},{"$error":"#REF!"},{"$error":"#REF!"},{"$error":"#REF!"}]
["S.18",{"$error":"#REF!"},{"$error":"#REF!"},{"$error":"#REF!"},{"$error":"#REF!"},{"$error":"#REF!"},{"$error":"#REF!"},{"$error":"#REF!"},{"$error":"#REF!"},{"$error":"#REF!"}]
["S.19",{"$error":"#REF!"},{"$error":"#REF!"},{"$error":"#REF!"},{"$error":"#REF!"},{"$error":"#REF!"},{"$error":"#REF!"},{"$error":"#REF!"},{"$error":"#REF!"},{"$error":"#REF!"}]
["S.20",{"$error":"#REF!"},{"$error":"#REF!"},{"$error":"#REF!"},{"$error":"#REF!"},{"$error":"#REF!"},{"$error":"#REF!"},{"$error":"#REF!"},{"$error":"#REF!"},{"$error":"#REF!"}]
{"$rows_left_out":81}
{"sheet":"Master Data Entry Template","index":3,"n_rows":20,"n_cols":4,"rows_kept":20,"cut":false,"hidden":false,"merged":[[0,0,0,2],[1,0,1,2],[2,0,2,2],[3,0,3,3],[8,0,8,2],[16,1,16,2],[17,1,17,2],[18,1,18,2],[19,1,19,2],[15,1,15,2]]}
[" Supervisor Title:"]
["Supervisor Name - First & Last: ",null,null,{"$f":"MID(CELL(\"filename\",A1),FIND(\"]\",CELL(\"filename\",A1))+1,255)","v":"Master Data Entry Template"}]
["Section 1:  Individual Span on Control Calculation"]
["Below, tally the number of FTEs who are direct reports to this supervisor.  Include all staff for whom the supervisor completes a performance evaluation and / or directs and oversees day-to-day work assignments.  For this calculation, each staff in an organization should have only one person to whom they directly report.  Hours worked by part time staff are summed and used to calculate a full time equivalent (FTE)."]
["Type of Staff Supervised","Definition","FTE Calculation Methodology","Number of FTE Supervised"]
["Regular Full Time Direct Reports","Include all regular full-time direct reports, including support staff.   This includes budgeted positions both filled and vacant, for whom the supervisor completes an evaluation.  Full-time staff work 2,080 hours per year.  Do not include part-time staff, temporary and seasonal employees, contractors, interns.    ","Each Full Time Direct Report = 1.0 FTE"]
["Regular Part Time Direct Reports","Include all regular part- time direct reports, including support staff -- both filled and vacant, for whom the supervisor a) completes and evaluation or. b) if no evaluation is done, a position for whom the supervisor directs and oversees day-to-day assignments.  This includes all budgeted part-time positions, at the time the report is completed, regardless of the number of hours worked. Do not include temporary and seasonal employees, contractors, interns.  ","Each Part-Time Direct Report = 1.0 FTE"]
["Total Number of FTE Equivalents Supervised",null,null,{"$f":"SUM(D6:D7)","v":0}]
["Section 2:  Additional Information"]
["Additional Staff Supervised Periodically","Definition","FTE Calculation Methodology","Number of FTE Supervised"]
["Temporary Direct Reports","Temporary direct reports are NOT included in the calculation for direct reports in Section 1.  They should, however, be counted here to inform decisions about an optimal span of contol for this supervisor.   Include all temporary employees supervised.  Do not include contractors, interns, seasonal.  For example, temporary employees hired directly for either full-time or part-time work through a time-limited grant program.  ","Calculate the number or fraction of FTE represented by the total number of hours worked by all temporary workers supervised.  Divide the total number of hours worked by all temporary employees during the fiscal year by 2,080 (or the number of hours worked by a regular FTE in that classification)."]
["Contract Workers Direct Reports","Contract Workers Direct Reports are NOT included in the calculation for direct reports in Section 1.  They should, however, be counted here to inform decisions about an optimal span of contol for this supervisor. Include contractor workers hired through personnel service contracts and whose day-to-day work is supervised by the manager or supervisor.  For example, workers hired through a personnel services contract such as administrative support.  Persons working for the county through a vendor contract that specifies services to be delivered are NOT counted. ","Calculate the number or fraction of FTE represented by the total number of hours worked by all contract workers supervised.  Divide the total number of hours worked by all contract employees during the fiscal year by 2,080 (or the number of hours worked by a regular FTE in that classification)."]
["Interns","Interns are NOT included in the calculation for direct reports in Section 1.  They should, however be counted here to inform decisions about an optimal span of control for this supervisor.  Interns typically work part-time and are associated with an education or job training program.","Calculate the number or fraction of FTE represented by the total number of hours worked by all interns supervised.  Divide the total number of hours worked by all interns during the fiscal year by 2,080 (or the number of hours worked by a regular FTE in that classification)."]
["Seasonal","Seasonal workers are NOT included in the calculation for direct reports in Section 1.  They should, however be counted here to inform decisions about an optimal span of control for this supervisor.  Seasonal workers are those employed for less than 4 months for activities associated with a season such as holidays or summer.","Calculate the number or fraction of FTE represented by the total number of hours worked by all seasonal workers supervised.  Divide the total number of hours worked by all seasonal employees during the fiscal year by 2,080 (or the number of hours worked by a regular FTE in that classification)."]
["Mitigating Factors","Definition"]
["Supervisor Responsibilities","Does the supervisor perform work similar to that of his/her direct reports?  For example, a case work supervisor who also provides direct service to clients."]
["Level of Risk","What is the level of risk to employee or the public in performing duties?  For example, is the work hazardous?  Is there a chance of loss or injury to employee or public?"]
["Proximity of Direct Reports ","Are direct reports in same office as supervisor or in satellite offices or field?"]
["Complex or Routine Tasks ","Are the tasks performed by the direct reports complex and variable, or standardized and routine?"]
["Availability of Technology","Do direct reports, not in the physical office with the supervisor, have mobile technology options available to communicate with supervisor and/or file reports? If all direct reports work in the same office, select N/A."]